Error detected during LiveSync on **DEVICE ID** xcode build error 65


#1

I am attempting to run a local build Debug through NativeScript Sidekick on my iPhone 7 and getting the following error(s):

I’m running High Sierra 10.13.3, XCode 9.2 with xcode command line tools for 10.13 and most recent updates.

[18-03-24 23:21:31.485] (CLI) ** BUILD FAILED **
[18-03-24 23:21:31.508] (CLI) Unable to apply changes on device: DEVICE ID REDACTED. Error is: Command xcodebuild failed with exit code 65 Error output:
[18-03-24 23:21:31.508] (CLI) ** BUILD FAILED **
[18-03-24 23:21:31.515] Error detected during LiveSync on DEVICE ID REDACTED for /Users/iosdev/dev/TestSideKick/TEST. Error: Command xcodebuild failed with exit code 65 Error output:
** BUILD FAILED **
[18-03-24 23:21:31.521] (CLI) Executing after-watch hook from /Users/iosdev/dev/TestSideKick/TEST/hooks/after-watch/nativescript-dev-sass.js
[18-03-24 23:21:31.569] Stopped LiveSync on DEVICE ID REDACTED for /Users/iosdev/dev/TestSideKick/TEST.

Any ideas? I’m all out of things to try at this point…haven’t found many specific items on error 65.